bugfixes in python wrapper

9 jobs for pybind11 in 16 minutes and 47 seconds (queued for 1 minute and 40 seconds)
Status Job ID Name Coverage
  Build Gcc Nocheck
failed #6604
job_make_gcc_nocheck

00:01:27

 
  Test Gcc Nocheck
skipped #6605
job_test_gcc_nocheck
 
  Code Coverage
passed #6606
job_code_coverage

00:05:22

76.278%
 
  Build Python2
passed #6607
job_build_python2

00:02:25

 
  Build Python3
passed #6608
job_build_python3

00:02:29

 
  Test Python2
failed #6609
job_test_python2

00:02:28

 
  Test Python3
failed #6610
job_test_python3

00:02:30

 
  Build Clang
failed #6611
job_make_clang

00:00:03

 
  Test Clang
skipped #6612
job_test_clang
 
Name Stage Failure
failed
job_make_gcc_nocheck Build Gcc Nocheck
       static_assert(is_same<typename _Alloc::value_type, _Tp>::value,
^~~~~~~~~~~~~~~~~~~~~~~~~~~~~~~~~~~~~~~~~
/usr/include/c++/8/bits/stl_vector.h: In instantiation of ‘class std::vector<std::pair<unsigned char*, unsigned char*>, __gnu_cxx::malloc_allocator<void*> >’:
include/xerus/misc/allocator.h:57:58: required from here
/usr/include/c++/8/bits/stl_vector.h:354:21: error: static assertion failed: std::vector must have the same value_type as its allocator
make: *** [Makefile:374: build/.miscObjects/src/xerus/misc/allocator.o] Error 1
Running after_script
Uploading artifacts for failed job
ERROR: Job failed: exit status 1
failed
job_test_python2 Test Python2
    __import__(modname)
E File "/home/gitlab-runner/builds/ebec6b58/0/xerus/xerus/src/pyTests/test_reconstruction/test_legendrePolynomials.py", line 60
E SyntaxError: Non-ASCII character '\xc3' in file /home/gitlab-runner/builds/ebec6b58/0/xerus/xerus/src/pyTests/test_reconstruction/test_legendrePolynomials.py on line 60, but no encoding declared; see http://python.org/dev/peps/pep-0263/ for details
!!!!!!!!!!!!!!!!!!! Interrupted: 10 errors during collection !!!!!!!!!!!!!!!!!!!
=========================== 10 error in 1.24 seconds ===========================
make: *** [Makefile:342: test_python2] Error 2
Running after_script
Uploading artifacts for failed job
ERROR: Job failed: exit status 1
failed
job_test_python3 Test Python3
/usr/lib/python3.7/ctypes/__init__.py:356: in __init__
self._handle = _dlopen(self._name, mode)
E OSError: /home/gitlab-runner/builds/ebec6b58/0/xerus/xerus/xerus/libxerus_misc.so: cannot open shared object file: No such file or directory
!!!!!!!!!!!!!!!!!!! Interrupted: 10 errors during collection !!!!!!!!!!!!!!!!!!!
=========================== 10 error in 1.46 seconds ===========================
make: *** [Makefile:348: test_python3] Error 2
Running after_script
Uploading artifacts for failed job
ERROR: Job failed: exit status 1
failed
job_make_clang Build Clang
Thread model: posix
InstalledDir: /usr/bin
mkdir -p build/.unitTestObjects/src/unitTests/
clang++-3.9 -D XERUS_UNITTEST -I include -I src/unitTests src/unitTests/fullTensor_product.cxx -c -std=c++11 -Wall -Wextra -pedantic -Wundef -Wunreachable-code -Wdisabled-optimization -Wcast-qual -Wsign-promo -Winit-self -Wnon-virtual-dtor -Woverloaded-virtual -Wconversion -Wfloat-equal -Wshadow -Wswitch-default -Wpacked -Wcast-align -Wctor-dtor-privacy -Wold-style-cast -Wlogical-op-parentheses -Wno-error=return-type-c-linkage -Wno-comment -Wno-unknown-pragmas -Wno-unused-parameter -Werror -ferror-limit=3 -Wno-error=unused-parameter -Wno-error=unused-variable -Wno-error=disabled-optimization -D XERUS_VERSION="v3.0.1-430-g914c755" -D XERUS_VERSION_MAJOR=3 -D XERUS_VERSION_MINOR=0 -D XERUS_VERSION_REVISION=1 -D XERUS_VERSION_COMMIT=430 -D XERUS_LOG_INFO -g -MMD -o build/.unitTestObjects/src/unitTests/fullTensor_product.o
/bin/sh: 1: clang++-3.9: not found
make: *** [Makefile:397: build/.unitTestObjects/src/unitTests/fullTensor_product.o] Error 127
Running after_script
Uploading artifacts for failed job
ERROR: Job failed: exit status 1