added move core functionality on binary tree - next steps testing

7 jobs for development_micha in 2 minutes and 42 seconds (queued for 2 seconds)
Status Job ID Name Coverage
  Build Gcc
failed #2963
job_make_gcc

00:00:01

 
  Test Gcc
skipped #2964
job_test_gcc
 
  Build Gcc Nocheck
skipped #2965
job_make_gcc_nocheck
 
  Test Gcc Nocheck
skipped #2966
job_test_gcc_nocheck
 
  Build Python
failed #2967
job_build_python

00:00:41

 
  Build Clang
passed #2968
job_make_clang

00:01:59

 
  Test Clang
skipped #2969
job_test_clang
 
Name Stage Failure
failed
job_build_python Build Python
src/xerus/htNetwork.cpp:1276:17:   required from here
src/xerus/htNetwork.cpp:216:24: error: conversion to ‘__gnu_cxx::__promote_2<int, long unsigned int, double, double>::__type {aka double}’ from ‘size_t {aka long unsigned int}’ may alter its value [-Werror=conversion]
for (size_t i = 0; i < std::pow(2,lvl + 1); i++){
~~^~~~~~~~~~~~~~~~~~~~~
compilation terminated due to -fmax-errors=3.
cc1plus: all warnings being treated as errors
Makefile:153: recipe for target 'build/libxerus.so' failed
make: *** [build/libxerus.so] Error 1
ERROR: Job failed: exit status 1
failed
job_make_gcc Build Gcc
g++ -D XERUS_UNITTEST include/xerus.h -c -Wall -Wextra -pedantic -Wundef -Wunreachable-code -Wdisabled-optimization -Wcast-qual -Wsign-promo -Winit-self -Wnon-virtual-dtor -Woverloaded-virtual -Wconversion -Wfloat-equal -Wshadow -Wswitch-default -Wpacked -Wcast-align -Wctor-dtor-privacy -Wold-style-cast -Wuseless-cast -Wno-error=useless-cast -Wlogical-op -Wtrampolines -Wnoexcept -Wno-comment -Wno-unknown-pragmas -Wno-unused-parameter -Werror -fmax-errors=3 -Wno-error=unused-parameter -Wno-error=unused-variable -Wno-error=disabled-optimization -Wno-error=unused-but-set-variable -Wno-error=maybe-uninitialized -D XERUS_VERSION="v3.0.1-15-g7427977" -DXERUS_VERSION_MAJOR=3 -DXERUS_VERSION_MINOR=0 -DXERUS_VERSION_REVISION=1 -DXERUS_VERSION_COMMIT=15 -D XERUS_TEST_COVERAGE -g -I /usr/include/python2.7/ -lboost_python -I/usr/lib64/python2.7/site-packages/numpy/core/include/ -lpython2.7 -fno-var-tracking-assignments -std=c++11 -MMD -o build/.preCompileHeaders/xerus.h.gch
In file included from include/xerus.h:53:0:
include/xerus/htNetwork.h:39:33: fatal error: xerus/misc/internal.h: No such file or directory
#include <xerus/misc/internal.h>
^
compilation terminated.
Makefile:286: recipe for target 'build/.preCompileHeaders/xerus.h.gch' failed
make: *** [build/.preCompileHeaders/xerus.h.gch] Error 1
ERROR: Job failed: exit status 1