Merge branch 'development' of hemioGit:xerus/xerus into development

8 jobs for development in 11 minutes and 17 seconds
Status Job ID Name Coverage
  Build Gcc Nocheck
failed #4772
job_make_gcc_nocheck

00:01:15

 
  Test Gcc Nocheck
skipped #4773
job_test_gcc_nocheck
 
  Code Coverage
passed #4774
job_code_coverage

00:05:16

77.364%
 
  Build Python2
failed #4775
job_build_python2

00:00:51

 
  Build Python3
failed #4776
job_build_python3

00:00:51

 
  Test Python2
failed #4777
job_test_python2

00:00:50

 
  Build Clang
failed #4778
job_make_clang

00:02:12

 
  Test Clang
skipped #4779
job_test_clang
 
Name Stage Failure
failed
job_make_clang Build Clang
                std::vector<double> setResiduals;
^
src/xerus/applications/uqAdf.cpp:474:33: note: previous declaration is here
std::vector<double> setResiduals;
^
3 errors generated.
Makefile:357: recipe for target 'build/.libObjects/src/xerus/applications/uqAdf.o' failed
make: *** [build/.libObjects/src/xerus/applications/uqAdf.o] Error 1
ERROR: Job failed: exit status 1
failed
job_test_python2 Test Python2
                                 ^~~~~~~~~~~~
src/xerus/applications/uqAdf.cpp:480:37: error: declaration of ‘setResiduals’ shadows a previous local [-Werror=shadow]
std::vector<double> setResiduals;
^~~~~~~~~~~~
compilation terminated due to -fmax-errors=3.
cc1plus: all warnings being treated as errors
Makefile:212: recipe for target 'build/libxerus.so' failed
make: *** [build/libxerus.so] Error 1
ERROR: Job failed: exit status 1
failed
job_build_python3 Build Python3
                                 ^~~~~~~~~~~~
src/xerus/applications/uqAdf.cpp:480:37: error: declaration of ‘setResiduals’ shadows a previous local [-Werror=shadow]
std::vector<double> setResiduals;
^~~~~~~~~~~~
compilation terminated due to -fmax-errors=3.
cc1plus: all warnings being treated as errors
Makefile:212: recipe for target 'build/libxerus.so' failed
make: *** [build/libxerus.so] Error 1
ERROR: Job failed: exit status 1
failed
job_build_python2 Build Python2
                                 ^~~~~~~~~~~~
src/xerus/applications/uqAdf.cpp:480:37: error: declaration of ‘setResiduals’ shadows a previous local [-Werror=shadow]
std::vector<double> setResiduals;
^~~~~~~~~~~~
compilation terminated due to -fmax-errors=3.
cc1plus: all warnings being treated as errors
Makefile:212: recipe for target 'build/libxerus.so' failed
make: *** [build/libxerus.so] Error 1
ERROR: Job failed: exit status 1
failed
job_make_gcc_nocheck Build Gcc Nocheck
                                 ^~~~~~~~~~~~
src/xerus/applications/uqAdf.cpp:480:37: error: declaration of ‘setResiduals’ shadows a previous local [-Werror=shadow]
std::vector<double> setResiduals;
^~~~~~~~~~~~
compilation terminated due to -fmax-errors=3.
cc1plus: all warnings being treated as errors
Makefile:357: recipe for target 'build/.libObjects/src/xerus/applications/uqAdf.o' failed
make: *** [build/.libObjects/src/xerus/applications/uqAdf.o] Error 1
ERROR: Job failed: exit status 1