Merge branch 'master' of hemioGit:xerus/xerus

8 jobs for master in 42 seconds (queued for 2 seconds)
Status Job ID Name Coverage
  Build Homepage
failed #2207
allowed to fail
job_build_homepage

00:00:01

 
  Build Gcc
failed #2208
job_make_gcc

00:00:01

 
  Test Gcc
skipped #2209
job_test_gcc
 
  Build Gcc Nocheck
skipped #2210
job_make_gcc_nocheck
 
  Test Gcc Nocheck
skipped #2211
job_test_gcc_nocheck
 
  Build Python
failed #2212
job_build_python

00:00:36

 
  Build Clang
failed #2213
job_make_clang

00:00:02

 
  Test Clang
skipped #2214
job_test_clang
 
Name Stage Failure
failed
job_build_homepage Build Homepage There is an unknown failure, please try again
   5bfe686..110f85a  master     -> origin/master
Checking out 110f85ab as master...
Skipping Git submodules setup
$ make -C doc doc; scp -r doc/html xerusweb:libxerus.org-443
make: Entering directory '/home/gitlab-runner/builds/9071116c/0/xerus/xerus/doc'
Makefile:27: ../config.mk: No such file or directory
make: *** No rule to make target '../config.mk'. Stop.
make: Leaving directory '/home/gitlab-runner/builds/9071116c/0/xerus/xerus/doc'
ERROR: Job failed: exit status 1
failed
job_make_gcc Build Gcc There is an unknown failure, please try again
mkdir -p build/.preCompileHeaders/
g++ -D XERUS_UNITTEST include/xerus.h -c -Wall -Wextra -pedantic -Wundef -Wunreachable-code -Wdisabled-optimization -Wcast-qual -Wsign-promo -Winit-self -Wnon-virtual-dtor -Woverloaded-virtual -Wconversion -Wfloat-equal -Wshadow -Wswitch-default -Wpacked -Wcast-align -Wctor-dtor-privacy -Wold-style-cast -Wuseless-cast -Wno-error=useless-cast -Wlogical-op -Wtrampolines -Wnoexcept -Wno-comment -Wno-unknown-pragmas -Wno-unused-parameter -Werror -fmax-errors=3 -Wno-error=unused-parameter -Wno-error=unused-variable -Wno-error=disabled-optimization -Wno-error=unused-but-set-variable -Wno-error=maybe-uninitialized -D XERUS_VERSION="v3.0.0-11-g110f85a" -DXERUS_VERSION_MAJOR=3 -DXERUS_VERSION_MINOR=0 -DXERUS_VERSION_REVISION=0 -DXERUS_VERSION_COMMIT=11 -D XERUS_TEST_COVERAGE -g -I /usr/include/python2.7/ -lboost_python -I/usr/lib64/python2.7/site-packages/numpy/core/include/ -lpython2.7 -fno-var-tracking-assignments -std=c++11 -MMD -o build/.preCompileHeaders/xerus.h.gch
include/xerus.h:63:53: fatal error: xerus/algorithms/crossApproximation.h: No such file or directory
#include "xerus/algorithms/crossApproximation.h"
^
compilation terminated.
Makefile:286: recipe for target 'build/.preCompileHeaders/xerus.h.gch' failed
make: *** [build/.preCompileHeaders/xerus.h.gch] Error 1
ERROR: Job failed: exit status 1
failed
job_build_python Build Python There is an unknown failure, please try again
compilation terminated.
In file included from src/xerus/algorithms/retractions.cpp:25:0:
include/xerus.h:63:53: fatal error: xerus/algorithms/crossApproximation.h: No such file or directory
#include "xerus/algorithms/crossApproximation.h"
^
compilation terminated.
Makefile:153: recipe for target 'build/libxerus.so' failed
make: *** [build/libxerus.so] Error 1
ERROR: Job failed: exit status 1
failed
job_make_clang Build Clang There is an unknown failure, please try again
clang++ -D XERUS_UNITTEST -I include src/unitTests/misc.cxx -c -Wall -Wextra -pedantic -Wundef -Wunreachable-code -Wdisabled-optimization -Wcast-qual -Wsign-promo -Winit-self -Wnon-virtual-dtor -Woverloaded-virtual -Wconversion -Wfloat-equal -Wshadow -Wswitch-default -Wpacked -Wcast-align -Wctor-dtor-privacy -Wold-style-cast -Wlogical-op-parentheses -Wno-error=return-type-c-linkage -Wno-comment -Wno-unknown-pragmas -Wno-unused-parameter -Werror -ferror-limit=3 -Wno-error=unused-parameter -Wno-error=unused-variable -Wno-error=disabled-optimization -D XERUS_LOG_INFO -D XERUS_VERSION="v3.0.0-11-g110f85a" -DXERUS_VERSION_MAJOR=3 -DXERUS_VERSION_MINOR=0 -DXERUS_VERSION_REVISION=0 -DXERUS_VERSION_COMMIT=11 -g -std=c++11 -MMD -o build/.unitTestObjects/src/unitTests/misc.o
In file included from src/unitTests/misc.cxx:21:
include/xerus.h:63:14: fatal error: 'xerus/algorithms/crossApproximation.h' file not found
#include "xerus/algorithms/crossApproximation.h"
^
1 error generated.
Makefile:273: recipe for target 'build/.unitTestObjects/src/unitTests/misc.o' failed
make: *** [build/.unitTestObjects/src/unitTests/misc.o] Error 1
ERROR: Job failed: exit status 1