Hopefully fixed xerus exceptions

8 jobs for development in 31 seconds (queued for 3 seconds)
Status Name Job ID Coverage
  Build Gcc Nocheck
failed job_make_gcc_nocheck #6180

00:00:08

 
  Test Gcc Nocheck
skipped job_test_gcc_nocheck #6181
 
  Code Coverage
passed job_code_coverage #6182

00:00:05

 
  Build Python2
failed job_build_python2 #6183

00:00:06

 
  Build Python3
failed job_build_python3 #6184

00:00:05

 
  Test Python2
failed job_test_python2 #6185

00:00:04

 
  Build Clang
failed job_make_clang #6186

00:00:00

 
  Test Clang
skipped job_test_clang #6187
 
Name Stage Failure
failed
job_make_gcc_nocheck Build Gcc Nocheck
   template<typename error_t, class T, typename std::enable_if<std::is_base_of<generic_error, std::remove_cvref_t<error_t>>::value, int>::type = 0>
^~~~~~~~~~~~~~
remove_extent
include/xerus/misc/exceptions.h:46:114: error: template argument 2 is invalid
template<typename error_t, class T, typename std::enable_if<std::is_base_of<generic_error, std::remove_cvref_t<error_t>>::value, int>::type = 0>
^~~~~~~
compilation terminated due to -fmax-errors=3.
make: *** [Makefile:391: build/.preCompileHeaders/xerus.h.gch] Error 1
ERROR: Job failed: exit status 1
failed
job_make_clang Build Clang
clang version 7.0.1-8 (tags/RELEASE_701/final)
Target: x86_64-pc-linux-gnu
Thread model: posix
InstalledDir: /usr/bin
mkdir -p build/.unitTestObjects/src/unitTests/
clang++-3.9 -D XERUS_UNITTEST -I include -I src/unitTests src/unitTests/fullTensor_product.cxx -c -std=c++11 -Wall -Wextra -pedantic -ftemplate-backtrace-limit=0 -Wundef -Wunreachable-code -Wdisabled-optimization -Wcast-qual -Wsign-promo -Winit-self -Wnon-virtual-dtor -Woverloaded-virtual -Wconversion -Wfloat-equal -Wshadow -Wswitch-default -Wpacked -Wcast-align -Wctor-dtor-privacy -Wold-style-cast -Wlogical-op-parentheses -Wno-error=return-type-c-linkage -Wno-comment -Wno-unknown-pragmas -Wno-unused-parameter -Werror -ferror-limit=3 -Wno-error=unused-parameter -Wno-error=unused-variable -Wno-error=disabled-optimization -D XERUS_VERSION="v3.0.1-339-gd925ba3" -D XERUS_VERSION_MAJOR=3 -D XERUS_VERSION_MINOR=0 -D XERUS_VERSION_REVISION=1 -D XERUS_VERSION_COMMIT=339 -D XERUS_LOG_INFO -g -MMD -o build/.unitTestObjects/src/unitTests/fullTensor_product.o
/bin/sh: 1: clang++-3.9: not found
make: *** [Makefile:378: build/.unitTestObjects/src/unitTests/fullTensor_product.o] Error 127
ERROR: Job failed: exit status 1
failed
job_test_python2 Test Python2
   template<typename error_t, class T, typename std::enable_if<std::is_base_of<generic_error, std::remove_cvref_t<error_t>>::value, int>::type = 0>
^~~~~~~~~~~~~~
remove_extent
include/xerus/misc/exceptions.h:46:114: error: template argument 2 is invalid
template<typename error_t, class T, typename std::enable_if<std::is_base_of<generic_error, std::remove_cvref_t<error_t>>::value, int>::type = 0>
^~~~~~~
compilation terminated due to -fmax-errors=3.
make: *** [Makefile:207: build/libxerus_misc.so] Error 1
ERROR: Job failed: exit status 1
failed
job_build_python3 Build Python3
   template<typename error_t, class T, typename std::enable_if<std::is_base_of<generic_error, std::remove_cvref_t<error_t>>::value, int>::type = 0>
^~~~~~~~~~~~~~
remove_extent
include/xerus/misc/exceptions.h:46:114: error: template argument 2 is invalid
template<typename error_t, class T, typename std::enable_if<std::is_base_of<generic_error, std::remove_cvref_t<error_t>>::value, int>::type = 0>
^~~~~~~
compilation terminated due to -fmax-errors=3.
make: *** [Makefile:207: build/libxerus_misc.so] Error 1
ERROR: Job failed: exit status 1
failed
job_build_python2 Build Python2
   template<typename error_t, class T, typename std::enable_if<std::is_base_of<generic_error, std::remove_cvref_t<error_t>>::value, int>::type = 0>
^~~~~~~~~~~~~~
remove_extent
include/xerus/misc/exceptions.h:46:114: error: template argument 2 is invalid
template<typename error_t, class T, typename std::enable_if<std::is_base_of<generic_error, std::remove_cvref_t<error_t>>::value, int>::type = 0>
^~~~~~~
compilation terminated due to -fmax-errors=3.
make: *** [Makefile:207: build/libxerus_misc.so] Error 1
ERROR: Job failed: exit status 1