update Dockerfiles

9 jobs for pybind11 in 19 minutes and 10 seconds (queued for 4 seconds)
Status Name Job ID Coverage
  Build Gcc Nocheck
passed job_make_gcc_nocheck #5628

00:01:38

 
  Test Gcc Nocheck
passed job_test_gcc_nocheck #5629

00:00:19

 
  Code Coverage
passed job_code_coverage #5630

00:05:16

76.984%
 
  Build Python2
failed job_build_python2 #5631

00:02:22

 
  Build Python3
failed job_build_python3 #5632

00:02:22

 
  Test Python2
failed job_test_python2 #5633

00:02:21

 
  Test Python3
failed job_test_python3 #5634

00:02:22

 
  Build Clang
passed job_make_clang #5635

00:02:26

 
  Test Clang
skipped job_test_clang #5636
 
Name Stage Failure
failed
job_test_python3 Test Python3
3rdParty/pybind11/include/pybind11/stl.h:298:5: warning: "PYBIND11_HAS_EXP_OPTIONAL" is not defined [-Wundef]
#if PYBIND11_HAS_EXP_OPTIONAL
^~~~~~~~~~~~~~~~~~~~~~~~~
3rdParty/pybind11/include/pybind11/stl.h:370:5: warning: "PYBIND11_HAS_VARIANT" is not defined [-Wundef]
#if PYBIND11_HAS_VARIANT
^~~~~~~~~~~~~~~~~~~~
Makefile:235: recipe for target 'build/python3/xerus.so' failed
make: *** [build/python3/xerus.so] Error 1
ERROR: Job failed: exit status 1
failed
job_test_python2 Test Python2
3rdParty/pybind11/include/pybind11/stl.h:298:5: warning: "PYBIND11_HAS_EXP_OPTIONAL" is not defined [-Wundef]
#if PYBIND11_HAS_EXP_OPTIONAL
^~~~~~~~~~~~~~~~~~~~~~~~~
3rdParty/pybind11/include/pybind11/stl.h:370:5: warning: "PYBIND11_HAS_VARIANT" is not defined [-Wundef]
#if PYBIND11_HAS_VARIANT
^~~~~~~~~~~~~~~~~~~~
Makefile:230: recipe for target 'build/python2/xerus.so' failed
make: *** [build/python2/xerus.so] Error 1
ERROR: Job failed: exit status 1
failed
job_build_python3 Build Python3
3rdParty/pybind11/include/pybind11/stl.h:298:5: warning: "PYBIND11_HAS_EXP_OPTIONAL" is not defined [-Wundef]
#if PYBIND11_HAS_EXP_OPTIONAL
^~~~~~~~~~~~~~~~~~~~~~~~~
3rdParty/pybind11/include/pybind11/stl.h:370:5: warning: "PYBIND11_HAS_VARIANT" is not defined [-Wundef]
#if PYBIND11_HAS_VARIANT
^~~~~~~~~~~~~~~~~~~~
Makefile:235: recipe for target 'build/python3/xerus.so' failed
make: *** [build/python3/xerus.so] Error 1
ERROR: Job failed: exit status 1
failed
job_build_python2 Build Python2
3rdParty/pybind11/include/pybind11/stl.h:298:5: warning: "PYBIND11_HAS_EXP_OPTIONAL" is not defined [-Wundef]
#if PYBIND11_HAS_EXP_OPTIONAL
^~~~~~~~~~~~~~~~~~~~~~~~~
3rdParty/pybind11/include/pybind11/stl.h:370:5: warning: "PYBIND11_HAS_VARIANT" is not defined [-Wundef]
#if PYBIND11_HAS_VARIANT
^~~~~~~~~~~~~~~~~~~~
Makefile:230: recipe for target 'build/python2/xerus.so' failed
make: *** [build/python2/xerus.so] Error 1
ERROR: Job failed: exit status 1